BDBM182022 US9145380, 225
SMILES NS(=O)(=O)c1ccccc1NS(=O)(=O)\C=C\c1ccccc1O
InChI Key InChIKey=HYWXZJNZWDXMHH-MDZDMXLPSA-N
Data  1 IC50
  Tab Delimited (TSV)   2D SDfile   Computed 3D by Vconf -m prep SDfile
Find this compound or compounds like it in BindingDB:
Activity Spreadsheet -- Enzyme Inhibition Constant Data from BindingDB
Found 1 hit for monomerid = 182022
TargetProstaglandin E synthase 2(Homo sapiens (Human))
Astrazeneca
US Patent
LigandPNGBDBM182022(US9145380, 225)
Affinity DataIC50:  6.30E+3nMpH: 6.8Assay Description:A solution of test compound was added to a diluted microsome preparation containing human mPGES-1 and pre-incubated for 15 minutes in potassium phosp...
In DepthDetails US Patent