BDBM182026 US9145380, 229
SMILES NS(=O)(=O)c1cc(F)cc(F)c1NS(=O)(=O)CCc1ccc(Cl)c(Cl)c1
InChI Key InChIKey=BQARJCVSHFPJNW-UHFFFAOYSA-N
Data  1 IC50
  Tab Delimited (TSV)   2D SDfile   Computed 3D by Vconf -m prep SDfile
Find this compound or compounds like it in BindingDB:
Activity Spreadsheet -- Enzyme Inhibition Constant Data from BindingDB
Found 1 hit for monomerid = 182026
TargetProstaglandin E synthase 2(Homo sapiens (Human))
Astrazeneca
US Patent
LigandPNGBDBM182026(US9145380, 229)
Affinity DataIC50:  5.50E+3nMpH: 6.8Assay Description:A solution of test compound was added to a diluted microsome preparation containing human mPGES-1 and pre-incubated for 15 minutes in potassium phosp...
In DepthDetails US Patent