BDBM182035 US9145380, 238
SMILES NS(=O)(=O)c1c2CCCc2ccc1NS(=O)(=O)\C=C\c1ccc(Cl)cc1
InChI Key InChIKey=WESBVZHTGWTWDV-ZHACJKMWSA-N
Data  1 IC50
  Tab Delimited (TSV)   2D SDfile   Computed 3D by Vconf -m prep SDfile
Find this compound or compounds like it in BindingDB:
Activity Spreadsheet -- Enzyme Inhibition Constant Data from BindingDB
Found 1 hit for monomerid = 182035
TargetProstaglandin E synthase 2(Homo sapiens (Human))
Astrazeneca
US Patent
LigandPNGBDBM182035(US9145380, 238)
Affinity DataIC50:  2.10E+3nMpH: 6.8Assay Description:A solution of test compound was added to a diluted microsome preparation containing human mPGES-1 and pre-incubated for 15 minutes in potassium phosp...
In DepthDetails US Patent