BDBM182234 US9669035, B-29
SMILES CCCCOc1cc(cnc1Cl)-c1nnc2c(C)nc3ccc(CN4CCOCC4)cc3n12
InChI Key InChIKey=PKPRTWSDEQLHCM-UHFFFAOYSA-N
Data  2 IC50
  Tab Delimited (TSV)   2D SDfile   Computed 3D by Vconf -m prep SDfile
Find this compound or compounds like it in BindingDB:
Activity Spreadsheet -- Enzyme Inhibition Constant Data from BindingDB
Found 2 hits for monomerid = 182234
TargetcAMP and cAMP-inhibited cGMP 3',5'-cyclic phosphodiesterase 10A(Rattus norvegicus (rat))
Janssen Pharmaceutica
US Patent
LigandPNGBDBM182234(US9669035, B-29)
Affinity DataIC50: >1.00E+4nMpH: 7.8 T: 2°C. Assay description: Rat recombinant PDE10A (rPDE10A2) was expressed in Sf9 cells using a recombinant rPDE10A baculovirus construct. Cells were harvested after 48 h of in...
Ligand InfoPC cidPC sid
In DepthDetails US Patent
TargetcGMP-dependent 3',5'-cyclic phosphodiesterase(Homo sapiens (Human))
Janssen Pharmaceutica
US Patent
LigandPNGBDBM182234(US9669035, B-29)
Affinity DataIC50:  120nMpH: 7.8 T: 2°C. Assay description: Human recombinant PDE2A (hPDE2A) was expressed in Sf9 cells using a recombinant rPDE10A baculovirus construct. Cells were harvested after 48 h of inf...
Ligand InfoPC cidPC sid
In DepthDetails US Patent