BDBM182741 US9145412, Table 1, Compound 7
SMILES Nc1ccc(cc1NC(=O)c1cnc2c(C3CC3)c(ccc2c1)N1CCNCC1)-c1ccccc1
InChI Key InChIKey=WRYKLWBWSPEKIL-UHFFFAOYSA-N
Data  3 IC50
  Tab Delimited (TSV)   2D SDfile   Computed 3D by Vconf -m prep SDfile
Find this compound or compounds like it in BindingDB:
Activity Spreadsheet -- Enzyme Inhibition Constant Data from BindingDB
Found 3 hits for monomerid = 182741
TargetHistone deacetylase 1(Homo sapiens (Human))
Acetylon Pharmaceuticals
US Patent
LigandPNGBDBM182741(US9145412, Table 1, Compound 7)
Affinity DataIC50:  7.80nMpH: 7.4Assay Description:Compounds for testing were diluted in DMSO to 50 fold the final concentration and a ten point three fold dilution series was made. The compounds were...
In DepthDetails US Patent
TargetHistone deacetylase 3(Homo sapiens (Human))
Acetylon Pharmaceuticals
US Patent
LigandPNGBDBM182741(US9145412, Table 1, Compound 7)
Affinity DataIC50:  164nMpH: 7.4Assay Description:Compounds for testing were diluted in DMSO to 50 fold the final concentration and a ten point three fold dilution series was made. The compounds were...
In DepthDetails US Patent
TargetHistone deacetylase 2(Homo sapiens (Human))
Acetylon Pharmaceuticals
US Patent
LigandPNGBDBM182741(US9145412, Table 1, Compound 7)
Affinity DataIC50:  15nMpH: 7.4Assay Description:Compounds for testing were diluted in DMSO to 50 fold the final concentration and a ten point three fold dilution series was made. The compounds were...
In DepthDetails US Patent