BDBM184235 US9150577, 98
SMILES CN(C)CCCn1c(NC(=O)c2ccc3cc4C(=O)NCC(C)(C)n4c3c2)nc2ccccc12
InChI Key InChIKey=NWWJMBOCMRICQS-UHFFFAOYSA-N
Data  1 IC50
  Tab Delimited (TSV)   2D SDfile   Computed 3D by Vconf -m prep SDfile
Find this compound or compounds like it in BindingDB:
Activity Spreadsheet -- Enzyme Inhibition Constant Data from BindingDB
Found 1 hit for monomerid = 184235
TargetRibosomal protein S6 kinase alpha-2(Homo sapiens (Human))
Boehringer Ingelheim International
US Patent
LigandPNGBDBM184235(US9150577, 98)
Affinity DataIC50:  0.380nMpH: 7.5Assay Description:Human RSK2 protein, purchased from Invitrogen, is used to measure kinase activity utilizing Kinase Glo Plus (Promega) a homogeneous assay technology,...
In DepthDetails US Patent