BDBM184259 US9150577, 129
SMILES C[C@@H]1CNC(=O)c2cc3ccc(cc3n12)C(=O)Nc1nc2ccccc2n1CCCN(C)C
InChI Key InChIKey=UNZXJJNYRSXYJL-MRXNPFEDSA-N
Data  1 IC50
  Tab Delimited (TSV)   2D SDfile   Computed 3D by Vconf -m prep SDfile
Find this compound or compounds like it in BindingDB:
Activity Spreadsheet -- Enzyme Inhibition Constant Data from BindingDB
Found 1 hit for monomerid = 184259
TargetRibosomal protein S6 kinase alpha-2(Homo sapiens (Human))
Boehringer Ingelheim International
US Patent
LigandPNGBDBM184259(US9150577, 129)
Affinity DataIC50:  0.700nMpH: 7.5Assay Description:Human RSK2 protein, purchased from Invitrogen, is used to measure kinase activity utilizing Kinase Glo Plus (Promega) a homogeneous assay technology,...
In DepthDetails US Patent