BDBM186940 US9079895, 26s
SMILES Cc1ncccc1OC[C@@H]1CN(CCN2CCc3ccccc23)CCO1
InChI Key InChIKey=DYMQPSSXRFHPQS-IBGZPJMESA-N
Data  1 KI
  Tab Delimited (TSV)   2D SDfile   Computed 3D by Vconf -m prep SDfile
Find this compound or compounds like it in BindingDB:
Activity Spreadsheet -- Enzyme Inhibition Constant Data from BindingDB
Found 1 hit for monomerid = 186940
TargetD(4) dopamine receptor(Mus musculus (Mouse))
University of Dundee
US Patent
LigandPNGBDBM186940(US9079895, 26s)
Affinity DataKi:  435nMpH: 7.4Assay Description:The detailed experimental protocols for the radioligand and functional receptor assays are available on the NIMH PDSP website at http://pdsp.med.un...
In DepthDetails US Patent