BDBM187228 US9670191, A19
SMILES Cc1ccc(C)c(c1)-c1[nH]c(cc1C(N)=O)-c1ccncc1
InChI Key InChIKey=XOUVLNZOKDHRPL-UHFFFAOYSA-N
Data  1 IC50
  Tab Delimited (TSV)   2D SDfile   Computed 3D by Vconf -m prep SDfile
Find this compound or compounds like it in BindingDB:
Activity Spreadsheet -- Enzyme Inhibition Constant Data from BindingDB
Found 1 hit for monomerid = 187228
TargetCell division cycle 7-related protein kinase [58-574]/Protein DBF4 homolog A(Homo sapiens (Human))
Nerviano Medical Sciences
US Patent
LigandPNGBDBM187228(US9670191, A19)
Affinity DataIC50: <1.00E+3nM. Assay description: The assay consists of the transfer of radioactivity labeled phosphate moiety by the kinase to an acceptor substrate. The resulting 33P-labeled produc...
Ligand InfoPC cidPC sid
In DepthDetails US Patent