BDBM187289 US9169240, 29
SMILES NS(=O)(=O)NCc1nnc(o1)C(=O)c1nc2ccc(cc2s1)-c1ccc(F)cc1
InChI Key InChIKey=RNPVUJKRQIQJFN-UHFFFAOYSA-N
Data  5 IC50
  Tab Delimited (TSV)   2D SDfile   Computed 3D by Vconf -m prep SDfile
Find this compound or compounds like it in BindingDB:
Activity Spreadsheet -- Enzyme Inhibition Constant Data from BindingDB
Found 5 hits for monomerid = 187289
TargetEndothelial lipase(Homo sapiens (Human))
Bristol-Myers Squibb
US Patent
LigandPNGBDBM187289(US9169240, 29)
Affinity DataIC50: <10nMpH: 8.0Assay Description:The enzymatic assay was measured using white, opaque 96-well half area plates. Each well contained 60 μL of assay buffer (50 mM HEPES pH 8.0, 50...
In DepthDetails US Patent
TargetEndothelial lipase(Homo sapiens (Human))
Bristol-Myers Squibb
US Patent
LigandPNGBDBM187289(US9169240, 29)
Affinity DataIC50: <10nM. Assay description: Inhibition of EL in human HT1080 cells using A10070 as substrate preincubated for 20 min followed by DMPG vesicle doped substrate addition and measur...
In DepthDetails ArticlePubMed
TargetEndothelial lipase(Homo sapiens (Human))
Bristol-Myers Squibb
US Patent
LigandPNGBDBM187289(US9169240, 29)
Affinity DataIC50: <200nM. Assay description: Inhibition of EL in human HT1080 cells using D31-POPC-HDL as substrate incubated for 2 hrs in presence of mouse plasma by LC/MS analysis
In DepthDetails ArticlePubMed
TargetEndothelial lipase(Homo sapiens (Human))
Bristol-Myers Squibb
US Patent
LigandPNGBDBM187289(US9169240, 29)
Affinity DataIC50: <200nM. Assay description: Inhibition of EL in human HT1080 cells using D31-POPC-HDL as substrate incubated for 2 hrs in presence of human serum by LC/MS analysis
In DepthDetails ArticlePubMed
TargetHepatic triacylglycerol lipase(Homo sapiens (Human))
TBA
Curated by ChEMBL
LigandPNGBDBM187289(US9169240, 29)
Affinity DataIC50:  10nM. Assay description: Inhibition of human HL expressed in human COS7 cells using A10070 as substrate preincubated for 20 min followed by DMPG vesicle doped substrate addit...
In DepthDetails ArticlePubMed