BDBM188384 US9169224, 72
SMILES Clc1ccc(cc1)S(=O)(=O)c1cccc(CN2CCN(CC2)C(=O)Nc2ccccc2)c1
InChI Key InChIKey=DOHWHMBCXUDGDI-UHFFFAOYSA-N
Data  1 IC50
  Tab Delimited (TSV)   2D SDfile   Computed 3D by Vconf -m prep SDfile
Find this compound or compounds like it in BindingDB:
Activity Spreadsheet -- Enzyme Inhibition Constant Data from BindingDB
Found 1 hit for monomerid = 188384
TargetFatty-acid amide hydrolase 1(Homo sapiens (Human))
Janssen Pharmaceutica
US Patent
LigandPNGBDBM188384(US9169224, 72)
Affinity DataIC50:  110nMpH: 9.0Assay Description:Assay Method 1: T84 frozen pellets (contents of 1-4x15 cm culture dishes) were homogenized in 300 mL of FAAH assay buffer (125 mM Tris, 1 mM EDTA, 0....
Ligand InfoPC cidPC sid
In DepthDetails US Patent