BDBM188447 US9169224, 136
SMILES O=C(Nc1ccccc1)N1CCN(Cc2cccc(Oc3ccc4OCOc4c3)c2)CC1
InChI Key InChIKey=HSLGFXMZBJCQII-UHFFFAOYSA-N
Data  1 IC50
  Tab Delimited (TSV)   2D SDfile   Computed 3D by Vconf -m prep SDfile
Find this compound or compounds like it in BindingDB:
Activity Spreadsheet -- Enzyme Inhibition Constant Data from BindingDB
Found 1 hit for monomerid = 188447
TargetFatty-acid amide hydrolase 1(Homo sapiens (Human))
Janssen Pharmaceutica
US Patent
LigandPNGBDBM188447(US9169224, 136)
Affinity DataIC50:  67nMpH: 9.0Assay Description:Assay Method 1: T84 frozen pellets (contents of 1-4x15 cm culture dishes) were homogenized in 300 mL of FAAH assay buffer (125 mM Tris, 1 mM EDTA, 0....
In DepthDetails US Patent