BDBM189808 US9174993, 60
SMILES Nc1n[nH]c2nc(cnc12)-c1ccc(NS(=O)(=O)c2cc(F)cc(F)c2Cl)cc1
InChI Key InChIKey=IZVSGTVZAXFORC-UHFFFAOYSA-N
Data  1 IC50
  Tab Delimited (TSV)   2D SDfile   Computed 3D by Vconf -m prep SDfile
Find this compound or compounds like it in BindingDB:
Activity Spreadsheet -- Enzyme Inhibition Constant Data from BindingDB
Found 1 hit for monomerid = 189808
TargetSerine/threonine-protein kinase Sgk1(Homo sapiens (Human))
Sanofi
US Patent
LigandPNGBDBM189808(US9174993, 60)
Affinity DataIC50:  31nM. Assay description: The compounds were tested for serum and glucocorticoid-regulated kinase 1 (SGK-1) inhibitory activity in a substrate phosphorylation assay designed t...
In DepthDetails US Patent