BDBM189900 US9174997, 120
SMILES CC1=C([N+]#[C-])[C@H](N(C(=O)OCc2ccccc2)C(=O)N1c1cccc(c1)C(F)(F)F)c1ccc(cc1S(C)(=O)=O)C#N
InChI Key InChIKey=DRXYFPBMYJUNAM-AREMUKBSSA-N
Data  1 IC50
  Tab Delimited (TSV)   2D SDfile   Computed 3D by Vconf -m prep SDfile
Find this compound or compounds like it in BindingDB:
Activity Spreadsheet -- Enzyme Inhibition Constant Data from BindingDB
Found 1 hit for monomerid = 189900
TargetNeutrophil elastase(Homo sapiens (Human))
Bayer Intellectual Property
US Patent
LigandPNGBDBM189900(US9174997, 120)
Affinity DataIC50: <0.300nMpH: 7.4 T: 2°C. Assay description: The potency of the compounds of the invention is ascertained in an in vitro inhibition assay. The HNE-mediated amidolytic cleavage of a suitable pept...
In DepthDetails US Patent