BDBM190244 US9175357, 5591
SMILES CNC(=O)c1cn(c2ccccc12)S(=O)(=O)c1ccccc1
InChI Key InChIKey=ZSTLNSLXYNDRIC-UHFFFAOYSA-N
Data  1 IC50
  Tab Delimited (TSV)   2D SDfile   Computed 3D by Vconf -m prep SDfile
Find this compound or compounds like it in BindingDB:
Activity Spreadsheet -- Enzyme Inhibition Constant Data from BindingDB
Found 1 hit for monomerid = 190244
TargetSerine/threonine-protein kinase PLK1(Homo sapiens (Human))
University of South Carolina
US Patent
LigandPNGBDBM190244(US9175357, 5591)
Affinity DataIC50:  3.75E+5nMpH: 8.0 T: 2°C. Assay description: The buffer composition was 50 mM Tris, 200 mM NaCl, 2.0 mM DTT, and 0.005% Tween 20 (pH 8.0). Fragment ligated inhibitors and comparison peptides to ...
In DepthDetails US Patent