BDBM190251 US9175357, 5600
SMILES CNC(=O)C1=CC(CCCN2CCOCC2)[N](=C1C)c1ccccc1
InChI Key InChIKey=JSTJELALMCFELW-UHFFFAOYSA-N
Data  1 IC50
  Tab Delimited (TSV)   2D SDfile   Computed 3D by Vconf -m prep SDfile
Find this compound or compounds like it in BindingDB:
Activity Spreadsheet -- Enzyme Inhibition Constant Data from BindingDB
Found 1 hit for monomerid = 190251
TargetSerine/threonine-protein kinase PLK1(Homo sapiens (Human))
University of South Carolina
US Patent
LigandPNGBDBM190251(US9175357, 5600)
Affinity DataIC50:  5.50E+5nMpH: 8.0 T: 2°C. Assay description: The buffer composition was 50 mM Tris, 200 mM NaCl, 2.0 mM DTT, and 0.005% Tween 20 (pH 8.0). Fragment ligated inhibitors and comparison peptides to ...
Ligand InfoPC cidPC sid
In DepthDetails US Patent