BDBM19179 2-phenyl-5H-indeno[1,2-d]pyrimidine::Aza-heterocyclic Derivative, 3b
SMILES C1c2ccccc2-c2nc(ncc12)-c1ccccc1
InChI Key InChIKey=GOMPLLCNQNCUNU-UHFFFAOYSA-N
Data  1 IC50
  Tab Delimited (TSV)   2D SDfile   Computed 3D by Vconf -m prep SDfile
Find this compound or compounds like it in BindingDB:
Activity Spreadsheet -- Enzyme Inhibition Constant Data from BindingDB
Found 2 hits for monomerid = 19179
TargetAmine oxidase [flavin-containing] B(Rattus norvegicus (rat))
University of Bari
LigandPNGBDBM19179(2-phenyl-5H-indeno[1,2-d]pyrimidine | Aza-heterocy...)
Affinity Data. Assay description: A continuous spectrophotometric assay that monitors the rate of oxidation of the nonselective MAO substrate kynuramine into 4-hydroxyquinoline was us...
In DepthDetails ArticlePubMed
TargetAmine oxidase [flavin-containing] A(Rattus norvegicus (rat))
University of Bari
LigandPNGBDBM19179(2-phenyl-5H-indeno[1,2-d]pyrimidine | Aza-heterocy...)
Affinity DataIC50:  1.80E+4nMpH: 7.4 T: 2°C. Assay description: A continuous spectrophotometric assay that monitors the rate of oxidation of the nonselective MAO substrate kynuramine into 4-hydroxyquinoline was us...
In DepthDetails ArticlePubMed