BDBM19180 4-phenyl-5H-indeno[1,2-d]pyrimidin-5-one::Aza-heterocyclic Derivative, 3e
SMILES O=C1c2ccccc2-c2ncnc(c12)-c1ccccc1
InChI Key InChIKey=UNTDCABJEUFVOR-UHFFFAOYSA-N
Data  2 IC50
  Tab Delimited (TSV)   2D SDfile   Computed 3D by Vconf -m prep SDfile
Find this compound or compounds like it in BindingDB:
Activity Spreadsheet -- Enzyme Inhibition Constant Data from BindingDB
Found 2 hits for monomerid = 19180
TargetAmine oxidase [flavin-containing] B(Rattus norvegicus (rat))
University of Bari
LigandPNGBDBM19180(4-phenyl-5H-indeno[1,2-d]pyrimidin-5-one | Aza-het...)
Affinity DataIC50:  3.40E+4nM. Assay description: A continuous spectrophotometric assay that monitors the rate of oxidation of the nonselective MAO substrate kynuramine into 4-hydroxyquinoline was us...
In DepthDetails ArticlePubMed
TargetAmine oxidase [flavin-containing] A(Rattus norvegicus (rat))
University of Bari
LigandPNGBDBM19180(4-phenyl-5H-indeno[1,2-d]pyrimidin-5-one | Aza-het...)
Affinity DataIC50:  2.16E+4nMpH: 7.4 T: 2°C. Assay description: A continuous spectrophotometric assay that monitors the rate of oxidation of the nonselective MAO substrate kynuramine into 4-hydroxyquinoline was us...
In DepthDetails ArticlePubMed