BDBM19181 3-phenyl-4aH,9H,9aH-indeno[1,2-e][1,2,4]triazin-9-one::Aza-heterocyclic Derivative, 4a
SMILES O=C1c2ccccc2-c2nc(nnc12)-c1ccccc1
InChI Key InChIKey=OERHOWFXDDHRBP-UHFFFAOYSA-N
Data  1 IC50  1 Other
  Tab Delimited (TSV)   2D SDfile   Computed 3D by Vconf -m prep SDfile
Find this compound or compounds like it in BindingDB:
Activity Spreadsheet -- Enzyme Inhibition Constant Data from BindingDB
Found 2 hits for monomerid = 19181
TargetAmine oxidase [flavin-containing] B(Rattus norvegicus (rat))
University of Bari
LigandPNGBDBM19181(3-phenyl-4aH,9H,9aH-indeno[1,2-e][1,2,4]triazin-9-...)
Affinity DataIC50:  6.31E+3nM. Assay description: A continuous spectrophotometric assay that monitors the rate of oxidation of the nonselective MAO substrate kynuramine into 4-hydroxyquinoline was us...
In DepthDetails ArticlePubMed
TargetAmine oxidase [flavin-containing] A(Rattus norvegicus (rat))
University of Bari
LigandPNGBDBM19181(3-phenyl-4aH,9H,9aH-indeno[1,2-e][1,2,4]triazin-9-...)
Affinity DatapH: 7.4 T: 2°C. Assay description: A continuous spectrophotometric assay that monitors the rate of oxidation of the nonselective MAO substrate kynuramine into 4-hydroxyquinoline was us...
In DepthDetails ArticlePubMed