BDBM191846 US9187428, 74
SMILES CNC(=O)c1cc(CSc2nc(N3CC(O)C3)c(C#N)c(-c3ccc(F)c(F)c3)c2C#N)ccn1
InChI Key InChIKey=XTHDMKNADLTFBY-UHFFFAOYSA-N
Data  3 EC50
  Tab Delimited (TSV)   2D SDfile   Computed 3D by Vconf -m prep SDfile
Find this compound or compounds like it in BindingDB:
Activity Spreadsheet -- Enzyme Inhibition Constant Data from BindingDB
Found 3 hits for monomerid = 191846
TargetAdenosine receptor A1(Homo sapiens (Human))
Bayer Intellectual Property
US Patent
LigandPNGBDBM191846(US9187428, 74)
Affinity DataEC50:  2.40nMpH: 7.4 T: 2°C. Assay description: The following test protocol is used for pharmacologically characterizing cells and for the robot-assisted substance screening:The stock cultures ar...
In DepthDetails US Patent
TargetAdenosine receptor A2b(Homo sapiens (Human))
Bayer Intellectual Property
US Patent
LigandPNGBDBM191846(US9187428, 74)
Affinity DataEC50:  3.00E+3nMpH: 7.4 T: 2°C. Assay description: The following test protocol is used for pharmacologically characterizing cells and for the robot-assisted substance screening:The stock cultures ar...
In DepthDetails US Patent
TargetAdenosine receptor A2a(Homo sapiens (Human))
Bayer Intellectual Property
US Patent
LigandPNGBDBM191846(US9187428, 74)
Affinity DataEC50:  3.00E+3nMpH: 7.4 T: 2°C. Assay description: The following test protocol is used for pharmacologically characterizing cells and for the robot-assisted substance screening:The stock cultures ar...
In DepthDetails US Patent