BDBM193792 N-(4-(bis(5-bromo-1H-indol-3-yl)methyl)phenyl)-4-nitrobenzenesulfonamide (4b)
SMILES [O-][N+](=O)c1ccc(cc1)S(=O)(=O)Nc1ccc(cc1)C(c1c[nH]c2ccc(Br)cc12)c1c[nH]c2ccc(Br)cc12
InChI Key InChIKey=UOAMQGNDZWQYDQ-UHFFFAOYSA-N
Data  1 IC50
  Tab Delimited (TSV)   2D SDfile   Computed 3D by Vconf -m prep SDfile
Find this compound or compounds like it in BindingDB:
Activity Spreadsheet -- Enzyme Inhibition Constant Data from BindingDB
Found 1 hit for monomerid = 193792
TargetCarbonic anhydrase 2(Bos taurus)
Universiti Teknologi Mara (Uitm)
LigandPNGBDBM193792(N-(4-(bis(5-bromo-1H-indol-3-yl)methyl)phenyl)-4-n...)
Affinity DataIC50:  6.39E+4nMpH: 7.2Assay Description:This was assay performed using buffer containing Tris and HEPES at the pH of 7.2-7.9 and a total concentration of 20 mM. 96-well plates were filled w...
In DepthDetails ArticlePubMed