BDBM193798 N-(4-(bis(5-bromo-1H-indol-3-yl)methyl)phenyl)-4-chloro-3-nitrobenzenesulfonamide (4h)
SMILES [O-][N+](=O)c1cc(ccc1Cl)S(=O)(=O)Nc1ccc(cc1)C(c1c[nH]c2ccc(Br)cc12)c1c[nH]c2ccc(Br)cc12
InChI Key InChIKey=YAVRQDJRVQPSTG-UHFFFAOYSA-N
Data  1 IC50
  Tab Delimited (TSV)   2D SDfile   Computed 3D by Vconf -m prep SDfile
Find this compound or compounds like it in BindingDB:
Activity Spreadsheet -- Enzyme Inhibition Constant Data from BindingDB
Found 1 hit for monomerid = 193798
TargetCarbonic anhydrase 2(Bos taurus)
Universiti Teknologi Mara (Uitm)
LigandPNGBDBM193798(N-(4-(bis(5-bromo-1H-indol-3-yl)methyl)phenyl)-4-c...)
Affinity DataIC50:  8.31E+4nMpH: 7.2Assay Description:This was assay performed using buffer containing Tris and HEPES at the pH of 7.2-7.9 and a total concentration of 20 mM. 96-well plates were filled w...
In DepthDetails ArticlePubMed