BDBM195494 US9212153, 158,Ex. 121::US9526727, Comparison Example Table 2, 2''-amino-4-methoxy-5''-oxo-1''-(propan-2-yl)-1'',5''-dihydro-3'H-dispiro[cyclohexane-1,2'-indene-1',4''-imidazole]-6'-carbonitrile
SMILES COC1CCC2(Cc3ccc(cc3C22N=C(N)N(C(C)C)C2=O)C#N)CC1
InChI Key InChIKey=HXYCKOWFLDTBJS-UHFFFAOYSA-N
Data  2 IC50
  Tab Delimited (TSV)   2D SDfile   Computed 3D by Vconf -m prep SDfile
Find this compound or compounds like it in BindingDB:
Activity Spreadsheet -- Enzyme Inhibition Constant Data from BindingDB
Found 2 hits for monomerid = 195494
TargetBeta-secretase 1 [1-454](Homo sapiens (Human))
Vitae Pharmaceutical
US Patent
LigandPNGBDBM195494(US9212153, 158,Ex. 121 | US9526727, Comparison Exa...)
Affinity DataIC50:  107nMpH: 4.4Assay Description:The inhibitory activity of compounds was assessed by a fluorescence quench assay of BACE1 activity using commercially available substrate HiLyte Fluo...
Ligand InfoPC cidPC sid
In DepthDetails US Patent
TargetBeta-secretase 1 [1-458](Homo sapiens (Human))
Vitae Pharmaceuticals
US Patent
LigandPNGBDBM195494(US9212153, 158,Ex. 121 | US9526727, Comparison Exa...)
Affinity DataIC50:  49.3nMpH: 4.4Assay Description:For each compound being tested, the BACE activity was monitored in a fluorescence quenching assay (FRET) using the ectodomain of BACE (aa 1-454) fuse...
Ligand InfoPC cidPC sid
In DepthDetails US Patent