BDBM196815 US9212186, 8
SMILES CCNc1nc(Nc2cnn3CCN(C)[C@H](C)c23)ncc1C(F)(F)F
InChI Key InChIKey=HPGKXVFNOILWCK-SECBINFHSA-N
Data  1 KI
  Tab Delimited (TSV)   2D SDfile   Computed 3D by Vconf -m prep SDfile
Find this compound or compounds like it in BindingDB:
Activity Spreadsheet -- Enzyme Inhibition Constant Data from BindingDB
Found 1 hit for monomerid = 196815
TargetLeucine-rich repeat serine/threonine-protein kinase 2(Homo sapiens (Human))
Genentech
US Patent
LigandPNGBDBM196815(US9212186, 8)
Affinity DataKi:  144nM. Assay description: This assay was used to determine a compound's potency in inhibiting activity of LRRK2 by determining, Kiapp, IC50, or percent inhibition values. In 3...
Ligand InfoPC cidPC sid
In DepthDetails US Patent