BDBM196833 US9212186, 30
SMILES CNc1nc(Nc2cc3COCCn3n2)ncc1C(F)(F)F
InChI Key InChIKey=XCCUEYIMZSXZGB-UHFFFAOYSA-N
Data  1 KI
  Tab Delimited (TSV)   2D SDfile   Computed 3D by Vconf -m prep SDfile
Find this compound or compounds like it in BindingDB:
Activity Spreadsheet -- Enzyme Inhibition Constant Data from BindingDB
Found 1 hit for monomerid = 196833
TargetLeucine-rich repeat serine/threonine-protein kinase 2(Homo sapiens (Human))
Genentech
US Patent
LigandPNGBDBM196833(US9212186, 30)
Affinity DataKi:  10.9nM. Assay description: This assay was used to determine a compound's potency in inhibiting activity of LRRK2 by determining, Kiapp, IC50, or percent inhibition values. In 3...
Ligand InfoPC cidPC sid
In DepthDetails US Patent