BDBM197628 US9216968, 228::US9732066, 228
SMILES COCc1nc2c(cc(NC(=O)c3ccccc3C(F)(F)F)cc2[nH]1)C(=O)Nc1nc2cc(Cl)ccc2o1
InChI Key InChIKey=YKDBUSRIEFLLNT-UHFFFAOYSA-N
Data  2 IC50
  Tab Delimited (TSV)   2D SDfile   Computed 3D by Vconf -m prep SDfile
Find this compound or compounds like it in BindingDB:
Activity Spreadsheet -- Enzyme Inhibition Constant Data from BindingDB
Found 2 hits for monomerid = 197628
TargetProstaglandin E synthase(Homo sapiens (Human))
Nippon Shinyaku
US Patent
LigandPNGBDBM197628(US9216968, 228 | US9732066, 228)
Affinity DataIC50:  1.70nM. Assay description: mPGES-1 microsome fractions were prepared from CHO-K1 cells transiently transfected with plasmid encoding the human mPGES-1cDNA. Microsomes were dilu...
Ligand InfoPC cidPC sid
In DepthDetails US Patent
TargetProstaglandin E synthase(Homo sapiens (Human))
Nippon Shinyaku
US Patent
LigandPNGBDBM197628(US9216968, 228 | US9732066, 228)
Affinity DataIC50:  1.70nM. Assay description: mPGES-1 microsome fractions were prepared from CHO-K1 cells transiently transfected with plasmid encoding the human mPGES-1cDNA. Microsomes were dilu...
Ligand InfoPC cidPC sid
In DepthDetails US Patent