BDBM198881 US9221797, 66
SMILES C=C(CN1CCOCC1)c1ccc(NC(=O)c2nc(c[nH]2)C#N)c(c1)C1=CCCCC1
InChI Key InChIKey=KLOTUKMGLQKKIX-UHFFFAOYSA-N
Data  1 IC50
  Tab Delimited (TSV)   2D SDfile   Computed 3D by Vconf -m prep SDfile
Find this compound or compounds like it in BindingDB:
Activity Spreadsheet -- Enzyme Inhibition Constant Data from BindingDB
Found 1 hit for monomerid = 198881
TargetMacrophage colony-stimulating factor 1 receptor [555-568](Homo sapiens (Human))
Janssen Pharmaceutica
US Patent
LigandPNGBDBM198881(US9221797, 66)
Affinity DataIC50:  3.90nMpH: 7.5Assay Description:A fluorescence polarization competition immunoassay was used to measure compound inhibition of CSF-1R phosphorylation of tyrosine on a synthetic CS...
Ligand InfoPC cidPC sid
In DepthDetails US Patent