BDBM198908 US9221797, 151
SMILES CC1(C)CCC(=CC1)c1cc(CN2CCNCC2)ccc1NC(=O)c1nc(c[nH]1)C#N
InChI Key InChIKey=FCEGNRXMBLQREV-UHFFFAOYSA-N
Data  1 IC50
  Tab Delimited (TSV)   2D SDfile   Computed 3D by Vconf -m prep SDfile
Find this compound or compounds like it in BindingDB:
Activity Spreadsheet -- Enzyme Inhibition Constant Data from BindingDB
Found 1 hit for monomerid = 198908
TargetMacrophage colony-stimulating factor 1 receptor [555-568](Homo sapiens (Human))
Janssen Pharmaceutica
US Patent
LigandPNGBDBM198908(US9221797, 151)
Affinity DataIC50:  0.820nMpH: 7.5Assay Description:A fluorescence polarization competition immunoassay was used to measure compound inhibition of CSF-1R phosphorylation of tyrosine on a synthetic CS...
Ligand InfoPC cidPC sid
In DepthDetails US Patent