BDBM200539 US9670231, 1.48
SMILES CN(C)[C@@H]1CCCN(C1)c1ccc(cc1C(F)(F)F)C(=O)N[C@@H]1[C@H]2Oc3ccc(Oc4ccnc5NC(=O)CCc45)cc3[C@@H]12
InChI Key InChIKey=QJJUWHGSXUKRET-MXQFTQDOSA-N
Data  4 IC50
  Tab Delimited (TSV)   2D SDfile   Computed 3D by Vconf -m prep SDfile
Find this compound or compounds like it in BindingDB:
Activity Spreadsheet -- Enzyme Inhibition Constant Data from BindingDB
Found 4 hits for monomerid = 200539
TargetSerine/threonine-protein kinase B-raf [V600E](Homo sapiens (Human))
Beigene
US Patent
LigandPNGBDBM200539(US9670231, 1.48)
Affinity DataIC50:  16nM. Assay description: TBD
Ligand InfoPC cidPC sid
In DepthDetails US Patent
TargetEpidermal growth factor receptor [T790M,L858R](Homo sapiens (Human))
Beigene
US Patent
LigandPNGBDBM200539(US9670231, 1.48)
Affinity DataIC50:  5.30nM. Assay description: TBD
Ligand InfoPC cidPC sid
In DepthDetails US Patent
TargetEpidermal growth factor receptor [L858R](Homo sapiens (Human))
Beigene
US Patent
LigandPNGBDBM200539(US9670231, 1.48)
Affinity DataIC50:  0.910nM. Assay description: TBD
Ligand InfoPC cidPC sid
In DepthDetails US Patent
TargetEpidermal growth factor receptor(Homo sapiens (Human))
Beigene
US Patent
LigandPNGBDBM200539(US9670231, 1.48)
Affinity DataIC50:  1.70nM. Assay description: TBD
Ligand InfoPC cidPC sid
In DepthDetails US Patent