BDBM200954 US9233946, 53
SMILES Cc1cc(Cl)cc(Cl)c1S(=O)(=O)Nc1cccc(c1)-c1nnn[nH]1
InChI Key InChIKey=HHNBQCHADDEVBY-UHFFFAOYSA-N
Data  1 IC50
  Tab Delimited (TSV)   2D SDfile   Computed 3D by Vconf -m prep SDfile
Find this compound or compounds like it in BindingDB:
Activity Spreadsheet -- Enzyme Inhibition Constant Data from BindingDB
Found 1 hit for monomerid = 200954
Target6-phosphofructo-2-kinase/fructose-2,6-bisphosphatase 3(Homo sapiens (Human))
Kancera
US Patent
LigandPNGBDBM200954(US9233946, 53)
Affinity DataIC50:  1.78E+3nM. Assay description: Method A: The kinase activity of the bi-functional enzyme is readily quantified based on the production of F-2,6-P2 as described by Van Schaftingen e...
Ligand InfoPC cidPC sid
In DepthDetails US Patent