BDBM203439 US9539260, B94
SMILES COc1ncc(cc1C)N1CCOc2ccc(O[C@H]3CCN(C3)C(=O)C3CCOC3)cc12
InChI Key InChIKey=VDESEAPCQCENDS-OZBJMMHXSA-N
Data  2 IC50
  Tab Delimited (TSV)   2D SDfile   Computed 3D by Vconf -m prep SDfile
Find this compound or compounds like it in BindingDB:
Activity Spreadsheet -- Enzyme Inhibition Constant Data from BindingDB
Found 2 hits for monomerid = 203439
LigandPNGBDBM203439(US9539260, B94)
Affinity DataIC50:  5nMT: 2°C. Assay description: Determination of Enzymatic PI3K Alpha and PI3K Delta Isoform Inhibition1.1 Test of Lipid Kinase ActivityThe efficacy of the compounds of examples 1-1...
Ligand InfoPC cidPC sid
In DepthDetails US Patent
LigandPNGBDBM203439(US9539260, B94)
Affinity DataIC50:  416nMT: 2°C. Assay description: Determination of Enzymatic PI3K Alpha and PI3K Delta Isoform Inhibition1.1 Test of Lipid Kinase ActivityThe efficacy of the compounds of examples 1-1...
Ligand InfoPC cidPC sid
In DepthDetails US Patent