BDBM205125 2-{[(3r,6r)-1-{[4-fluoro-2- (1,3-thiazol-2- yl)phenyl]carbonyl}-6- methylpiperidin-3-yl]oxy}-3- methylpyridine-4-carbonitrile::US9546152, example 34
SMILES C[C@@H]1CC[C@H](CN1C(=O)c1ccc(F)cc1-c1nccs1)Oc1nccc(C#N)c1C
InChI Key InChIKey=WEPOQCBGFBAHKW-RDTXWAMCSA-N
Data  2 KI  2 IC50
  Tab Delimited (TSV)   2D SDfile   Computed 3D by Vconf -m prep SDfile
Find this compound or compounds like it in BindingDB:
Activity Spreadsheet -- Enzyme Inhibition Constant Data from BindingDB
Found 4 hits for monomerid = 205125
TargetOrexin receptor type 2(Homo sapiens (Human))
Merck Sharp & Dohme
US Patent
LigandPNGBDBM205125(2-{[(3r,6r)-1-{[4-fluoro-2- (1,3-thiazol-2- yl)phe...)
Affinity DataKi:  0.200nM. Assay description: Radioligand binding assay (described in Bergman et. al. Bioorg. Med. Chem. Lett. 2008, 18, 1425-1430) in which the inhibition constant (Ki) is determ...
Ligand InfoPC cidPC sid
In DepthDetails US Patent
TargetOrexin/Hypocretin receptor type 1(Homo sapiens (Human))
Merck Sharp & Dohme
US Patent
LigandPNGBDBM205125(2-{[(3r,6r)-1-{[4-fluoro-2- (1,3-thiazol-2- yl)phe...)
Affinity DataKi:  180nM. Assay description: Radioligand binding assay (described in Bergman et. al. Bioorg. Med. Chem. Lett. 2008, 18, 1425-1430) in which the inhibition constant (Ki) is determ...
Ligand InfoPC cidPC sid
In DepthDetails US Patent
TargetOrexin receptor type 2(Homo sapiens (Human))
Merck Sharp & Dohme
US Patent
LigandPNGBDBM205125(2-{[(3r,6r)-1-{[4-fluoro-2- (1,3-thiazol-2- yl)phe...)
Affinity DataIC50:  9nM. Assay description: The utility of the compounds in accordance with the present invention as orexin receptor OX1R and/or OX2R antagonists may be readily determined witho...
Ligand InfoPC cidPC sid
In DepthDetails US Patent
TargetOrexin/Hypocretin receptor type 1(Homo sapiens (Human))
Merck Sharp & Dohme
US Patent
LigandPNGBDBM205125(2-{[(3r,6r)-1-{[4-fluoro-2- (1,3-thiazol-2- yl)phe...)
Affinity DataIC50:  702nM. Assay description: The utility of the compounds in accordance with the present invention as orexin receptor OX1R and/or OX2R antagonists may be readily determined witho...
Ligand InfoPC cidPC sid
In DepthDetails US Patent