BDBM206275 (S)-N1-(3-(1H-indol-3-yl)-1-oxo-1-(phenylamino)propan-2-yl)-N4-hydroxyterephthalamide (12a)
SMILES ONC(=O)c1ccc(cc1)C(=O)N[C@H](C(=O)Nc1ccccc1)c1c[nH]c2ccccc12
InChI Key
Data  1 IC50
  Tab Delimited (TSV)   2D SDfile   Computed 3D by Vconf -m prep SDfile
Find this compound or compounds like it in BindingDB:
Activity Spreadsheet -- Enzyme Inhibition Constant Data from BindingDB
Found 1 hit for monomerid = 206275
TargetHistone deacetylase 1/11/4/6/8(Homo sapiens (Human))
Shandong University
LigandPNGBDBM206275((S)-N1-(3-(1H-indol-3-yl)-1-oxo-1-(phenylamino)pro...)
Affinity DataIC50:  361nM. Assay description: In brief, 10 μL of HeLa nuclear extract was mixed with various concentrations of target compounds (50 μL), SAHA, using 100% and none HDACs ...
Ligand InfoPC cidPC sid
In DepthDetails ArticlePubMed