BDBM206764 US9260448, 58
SMILES Cc1ccc(cc1)-c1csc2c1ncn(-c1ccc(Cl)cc1)c2=O
InChI Key InChIKey=LKCPQVXWQATDFS-UHFFFAOYSA-N
Data  1 IC50
  Tab Delimited (TSV)   2D SDfile   Computed 3D by Vconf -m prep SDfile
Find this compound or compounds like it in BindingDB:
Activity Spreadsheet -- Enzyme Inhibition Constant Data from BindingDB
Found 1 hit for monomerid = 206764
TargetMetabotropic glutamate receptor 1(Homo sapiens (Human))
Korea Institute of Science and Technology
US Patent
LigandPNGBDBM206764(US9260448, 58)
Affinity DataIC50:  80nM. Assay description: Cells of Chem3 Cell Line (HTS145C:Millipore) in which mGluR1 was stably expressed were adjusted to a density of 2×106/ml. 50 μl of the cells wer...
In DepthDetails US Patent