BDBM206826 US9249163, 24
SMILES CN1C(=O)NS(=O)(=O)c2cc(ccc12)-c1cnc(N2CCOCC2)c2nc(\C=C\c3ccc4ccccc4n3)cn12
InChI Key InChIKey=YNDIDFJWGPLROE-MDZDMXLPSA-N
Data  2 IC50
  Tab Delimited (TSV)   2D SDfile   Computed 3D by Vconf -m prep SDfile
Find this compound or compounds like it in BindingDB:
Activity Spreadsheet -- Enzyme Inhibition Constant Data from BindingDB
Found 2 hits for monomerid = 206826
TargetcAMP and cAMP-inhibited cGMP 3',5'-cyclic phosphodiesterase 10A(Homo sapiens (Human))
Janssen Pharmaceutica
US Patent
LigandPNGBDBM206826(US9249163, 24)
Affinity DataIC50:  3nM. Assay description: Human recombinant PDE10A2 was expressed in Sf9 cells, using a recombinant baculovirus construct containing the full length sequence containing a 6×Hi...
Ligand InfoPC cidPC sid
In DepthDetails US Patent
TargetcAMP and cAMP-inhibited cGMP 3',5'-cyclic phosphodiesterase 10A(Rattus norvegicus (rat))
Janssen Pharmaceutica
US Patent
LigandPNGBDBM206826(US9249163, 24)
Affinity DataIC50:  5nMpH: 7.8Assay Description:Rat recombinant PDE10a (rPDE10a) was expressed in Sf9 cells using a recombinant rPDE10a baculovirus construct. Cells were harvested after 48 h of inf...
Ligand InfoPC cidPC sid
In DepthDetails US Patent