BDBM206871 US9249163, 17
SMILES OC(=O)c1ccc(cc1)-c1cnc(N2CCOCC2)c2nc(CCc3ccc4ccccc4n3)cn12
InChI Key InChIKey=ZCIFTLSXHKGTQU-UHFFFAOYSA-N
Data  2 IC50
  Tab Delimited (TSV)   2D SDfile   Computed 3D by Vconf -m prep SDfile
Find this compound or compounds like it in BindingDB:
Activity Spreadsheet -- Enzyme Inhibition Constant Data from BindingDB
Found 2 hits for monomerid = 206871
TargetcAMP and cAMP-inhibited cGMP 3',5'-cyclic phosphodiesterase 10A(Homo sapiens (Human))
Janssen Pharmaceutica
US Patent
LigandPNGBDBM206871(US9249163, 17)
Affinity DataIC50:  3nM. Assay description: Human recombinant PDE10A2 was expressed in Sf9 cells, using a recombinant baculovirus construct containing the full length sequence containing a 6×Hi...
Ligand InfoPC cidPC sid
In DepthDetails US Patent
TargetcAMP and cAMP-inhibited cGMP 3',5'-cyclic phosphodiesterase 10A(Rattus norvegicus (rat))
Janssen Pharmaceutica
US Patent
LigandPNGBDBM206871(US9249163, 17)
Affinity DataIC50:  3nMpH: 7.8Assay Description:Rat recombinant PDE10a (rPDE10a) was expressed in Sf9 cells using a recombinant rPDE10a baculovirus construct. Cells were harvested after 48 h of inf...
Ligand InfoPC cidPC sid
In DepthDetails US Patent