BDBM207621 US10501467, Example 66::US9260440, 66::US9617273, Example 66
SMILES CC1(C)Cc2n(CCO)c3cccc4c3c2c(C1)nn(CCO)c4=O
InChI Key InChIKey=OZDPEWPAHUWNKA-UHFFFAOYSA-N
Data  3 IC50
  Tab Delimited (TSV)   2D SDfile   Computed 3D by Vconf -m prep SDfile
Find this compound or compounds like it in BindingDB:
Activity Spreadsheet -- Enzyme Inhibition Constant Data from BindingDB
Found 1 hit for monomerid = 207621
TargetPoly [ADP-ribose] polymerase 1(Homo sapiens (Human))
Beigene
US Patent
LigandPNGBDBM207621(US10501467, Example 66 | US9260440, 66 | US9617273...)
Affinity DataIC50:  1.90E+6nM. Assay description: PARP-1 enzymatic assay was conducted using a method modified from HT F Homogeneous PARP Inhibition Assay Kit (Trevigen). 8.8 nM PARP-1 was pre-incuba...
Ligand InfoPC cidPC sid
In DepthDetails US Patent