BDBM207852 US9266832, Cpd009
SMILES Clc1ccc2[nH]cc(CCNC(=O)c3ccccc3Cc3ccccc3)c2c1
InChI Key InChIKey=AZXMWQBBQWWRPJ-UHFFFAOYSA-N
Data  1 EC50
  Tab Delimited (TSV)   2D SDfile   Computed 3D by Vconf -m prep SDfile
Find this compound or compounds like it in BindingDB:
Activity Spreadsheet -- Enzyme Inhibition Constant Data from BindingDB
Found 1 hit for monomerid = 207852
TargetAlpha-synuclein(Homo sapiens (Human))
Katholieke Universiteit Levun
US Patent
LigandPNGBDBM207852(US9266832, Cpd009)
Affinity DataEC50:  240nM. Assay description: α-Synucleinopathies are characterised by aggregation of α-synuclein in neurons. Aggregation of purified α-synuclein is performed essen...
Ligand InfoPC cidPC sid
In DepthDetails US Patent