BDBM20912 5-[2,4-dihydroxy-5-(2-phenylethyl)phenyl]-N-ethyl-4-[4-(morpholin-4-ylmethyl)phenyl]-1,2-oxazole-3-carboxamide::Isoxazole, 40b
SMILES CCNC(=O)c1noc(c1-c1ccc(CN2CCOCC2)cc1)-c1cc(CCc2ccccc2)c(O)cc1O
InChI Key InChIKey=NBORIEUQDSFVFQ-UHFFFAOYSA-N
Data  1 IC50  1 EC50
  Tab Delimited (TSV)   2D SDfile   Computed 3D by Vconf -m prep SDfile
Find this compound or compounds like it in BindingDB:
Activity Spreadsheet -- Enzyme Inhibition Constant Data from BindingDB
Found 1 hit for monomerid = 20912
TargetHeat shock protein HSP 90-beta(Homo sapiens (Human))
Vernalis (R&D)
LigandPNGBDBM20912(5-[2,4-dihydroxy-5-(2-phenylethyl)phenyl]-N-ethyl-...)
Affinity DataIC50:  32nM EC50:  29nM. Assay description: The assay is based upon displacement of a fluorescently labeled molecule, which binds specifically to the ATP-binding site of full-length human Hsp90...
In DepthDetails ArticlePubMed