BDBM210763 US9290454, 7.1
SMILES OC(=O)CCCCc1cc2cc(ccc2c(=O)n1-c1ccc(F)cc1)-c1noc(n1)C1Cc2ccccc2C1
InChI Key InChIKey=UEFHXFQVVKUMGH-UHFFFAOYSA-N
Data  1 KI
  Tab Delimited (TSV)   2D SDfile   Computed 3D by Vconf -m prep SDfile
Find this compound or compounds like it in BindingDB:
Activity Spreadsheet -- Enzyme Inhibition Constant Data from BindingDB
Found 1 hit for monomerid = 210763
TargetProstaglandin D2 receptor 2(Homo sapiens (Human))
Merck Sharp & Dohme
US Patent
LigandPNGBDBM210763(US9290454, 7.1)
Affinity DataKi:  21.5nM ΔG°:  -11.3kcal/molepH: 7.4 T: 2°C. Assay description: Radioligand binding was performed using filtration or scintillation proximity assay (SPA) technology. SPA assays were done at room temperature in 10 ...
Ligand InfoPC cidPC sid
In DepthDetails US Patent