BDBM210765 US9290454, 7.3
SMILES CC(c1nc(no1)-c1ccc2c(c1)cc(CCCCC(O)=O)n(-c1ccc(F)cc1)c2=O)c1ccc(F)cc1
InChI Key InChIKey=USYXKYAAHXSOEK-UHFFFAOYSA-N
Data  1 KI
  Tab Delimited (TSV)   2D SDfile   Computed 3D by Vconf -m prep SDfile
Find this compound or compounds like it in BindingDB:
Activity Spreadsheet -- Enzyme Inhibition Constant Data from BindingDB
Found 1 hit for monomerid = 210765
TargetProstaglandin D2 receptor 2(Homo sapiens (Human))
Merck Sharp & Dohme
US Patent
LigandPNGBDBM210765(US9290454, 7.3)
Affinity DataKi:  12.7nM ΔG°:  -11.7kcal/molepH: 7.4 T: 2°C. Assay description: Radioligand binding was performed using filtration or scintillation proximity assay (SPA) technology. SPA assays were done at room temperature in 10 ...
Ligand InfoPC cidPC sid
In DepthDetails US Patent