BDBM210770 US9290454, 8.4
SMILES C[C@@H]1CN(CCN1C(=O)c1ccc2c(cc(CCCCC(=O)NS(=O)(=O)C3CC3)n(-c3ccc(F)cc3)c2=O)c1)c1ccccc1
InChI Key InChIKey=LREPIFITZPTFID-XMMPIXPASA-N
Data  1 KI
  Tab Delimited (TSV)   2D SDfile   Computed 3D by Vconf -m prep SDfile
Find this compound or compounds like it in BindingDB:
Activity Spreadsheet -- Enzyme Inhibition Constant Data from BindingDB
Found 1 hit for monomerid = 210770
TargetProstaglandin D2 receptor 2(Homo sapiens (Human))
Merck Sharp & Dohme
US Patent
LigandPNGBDBM210770(US9290454, 8.4)
Affinity DataKi:  37.2nM ΔG°:  -11.0kcal/molepH: 7.4 T: 2°C. Assay description: Radioligand binding was performed using filtration or scintillation proximity assay (SPA) technology. SPA assays were done at room temperature in 10 ...
Ligand InfoPC cidPC sid
In DepthDetails US Patent