BDBM210772 US9290454, 8.6
SMILES Fc1ccc(Cc2nc(no2)-c2ccc3c(cc(CCCCC(=O)NS(=O)(=O)C4CC4)n(-c4ccc(F)cc4)c3=O)c2)cc1
InChI Key InChIKey=WQIGRNJPIKWQIR-UHFFFAOYSA-N
Data  1 KI
  Tab Delimited (TSV)   2D SDfile   Computed 3D by Vconf -m prep SDfile
Find this compound or compounds like it in BindingDB:
Activity Spreadsheet -- Enzyme Inhibition Constant Data from BindingDB
Found 1 hit for monomerid = 210772
TargetProstaglandin D2 receptor 2(Homo sapiens (Human))
Merck Sharp & Dohme
US Patent
LigandPNGBDBM210772(US9290454, 8.6)
Affinity DataKi:  17.3nM ΔG°:  -11.5kcal/molepH: 7.4 T: 2°C. Assay description: Radioligand binding was performed using filtration or scintillation proximity assay (SPA) technology. SPA assays were done at room temperature in 10 ...
Ligand InfoPC cidPC sid
In DepthDetails US Patent