BDBM21116 3-{N'-[(2S)-2-{2-[(2R)-2-[(2S)-2-amino-3-(4-hydroxyphenyl)propanamido]propanamido]acetamido}-3-phenylpropanoyl]hydrazinecarbonyl}-N-[1-(2-phenylethyl)piperidin-4-yl]propanamide::4-anilidopiperidine, 11
SMILES C[C@@H](NC(=O)[C@@H](N)Cc1ccc(O)cc1)C(=O)NCC(=O)N[C@@H](Cc1ccccc1)C(=O)NNC(=O)CCC(=O)NC1CCN(CCc2ccccc2)CC1
InChI Key InChIKey=DSXQNAAVJJDPAE-KUSJRIKGSA-N
Data  2 KI  2 EC50
  Tab Delimited (TSV)   2D SDfile   Computed 3D by Vconf -m prep SDfile
Find this compound or compounds like it in BindingDB:
Activity Spreadsheet -- Enzyme Inhibition Constant Data from BindingDB
Found 2 hits for monomerid = 21116
TargetMu-type opioid receptor(Rattus norvegicus (rat))
University of Arizona Tucson
LigandPNGBDBM21116(3-{N'-[(2S)-2-{2-[(2R)-2-[(2S)-2-amino-3-(4-hydrox...)
Affinity DataKi:  1.20nM ΔG°:  -12.2kcal/mole EC50:  16nMpH: 7.4 T: 2°C. Assay description: Log IC50 values for each test compound were determined from nonlinear regression analysis of data collected from two independent experiments performe...
In DepthDetails ArticlePubMed
TargetDelta-type opioid receptor(Homo sapiens (Human))
University of Arizona Tucson
LigandPNGBDBM21116(3-{N'-[(2S)-2-{2-[(2R)-2-[(2S)-2-amino-3-(4-hydrox...)
Affinity DataKi:  3.70nM ΔG°:  -11.5kcal/mole EC50:  29nMpH: 7.4 T: 2°C. Assay description: Log IC50 values for each test compound were determined from nonlinear regression analysis of data collected from two independent experiments performe...
In DepthDetails ArticlePubMed