BDBM212173 US9290487, compound of Ex. 20
SMILES OC(=O)[C@@H]1CCCN1C(=O)c1cccc(COc2ccc(cc2)-c2c(F)cc(F)c3ccoc23)c1
InChI Key InChIKey=RPGYHWZWHIVOBY-QHCPKHFHSA-N
Data  1 EC50
  Tab Delimited (TSV)   2D SDfile   Computed 3D by Vconf -m prep SDfile
Find this compound or compounds like it in BindingDB:
Activity Spreadsheet -- Enzyme Inhibition Constant Data from BindingDB
Found 1 hit for monomerid = 212173
TargetGlycogen [starch] synthase, muscle(Homo sapiens (Human))
Ajinomoto
US Patent
LigandPNGBDBM212173(US9290487, compound of Ex. 20)
Affinity DataEC50:  64nMpH: 7.3 T: 2°C. Assay description: To a polystyrene 96-well plate, a solution containing 30 mM glycylglycine (pH 7.3), 40 mM KCl, 20 mM MgCl2, 9.2% DMSO containing one of the test comp...
Ligand InfoPC cidPC sid
In DepthDetails US Patent