BDBM212203 US9290487, compound of Ex. 51
SMILES CC(=O)CSc1cc(F)c(F)cc1-c1ccc(OCc2cccc(c2)C(=O)N2CCC[C@H]2C(O)=O)cc1
InChI Key InChIKey=QDBWDGKZMICXBR-VWLOTQADSA-N
Data  1 EC50
  Tab Delimited (TSV)   2D SDfile   Computed 3D by Vconf -m prep SDfile
Find this compound or compounds like it in BindingDB:
Activity Spreadsheet -- Enzyme Inhibition Constant Data from BindingDB
Found 1 hit for monomerid = 212203
TargetGlycogen [starch] synthase, muscle(Homo sapiens (Human))
Ajinomoto
US Patent
LigandPNGBDBM212203(US9290487, compound of Ex. 51)
Affinity DataEC50:  83nMpH: 7.3 T: 2°C. Assay description: To a polystyrene 96-well plate, a solution containing 30 mM glycylglycine (pH 7.3), 40 mM KCl, 20 mM MgCl2, 9.2% DMSO containing one of the test comp...
Ligand InfoPC cidPC sid
In DepthDetails US Patent