BDBM212210 US9290487, compound of Ex. 58
SMILES O\N=C\c1cc2c(F)c(F)cc(-c3ccc(OCc4cccc(c4)C(=O)N4CCC[C@H]4C(O)=O)cc3)c2o1
InChI Key InChIKey=VGEYGNOFIBFCQW-PSVUBMJASA-N
Data  1 EC50
  Tab Delimited (TSV)   2D SDfile   Computed 3D by Vconf -m prep SDfile
Find this compound or compounds like it in BindingDB:
Activity Spreadsheet -- Enzyme Inhibition Constant Data from BindingDB
Found 1 hit for monomerid = 212210
TargetGlycogen [starch] synthase, muscle(Homo sapiens (Human))
Ajinomoto
US Patent
LigandPNGBDBM212210(US9290487, compound of Ex. 58)
Affinity DataEC50:  45nMpH: 7.3 T: 2°C. Assay description: To a polystyrene 96-well plate, a solution containing 30 mM glycylglycine (pH 7.3), 40 mM KCl, 20 mM MgCl2, 9.2% DMSO containing one of the test comp...
Ligand InfoKEGGPC cidPC sid
In DepthDetails US Patent