BDBM21227 2-mercaptopyrimidine analogue, 5f::N-[6-methoxy-2-(propylsulfanyl)pyrimidin-4-yl]propanamide
SMILES CCCSc1nc(NC(=O)CC)cc(OC)n1
InChI Key InChIKey=DZGIGWSCYGMAOL-UHFFFAOYSA-N
Data  2 KI
  Tab Delimited (TSV)   2D SDfile   Computed 3D by Vconf -m prep SDfile
Find this compound or compounds like it in BindingDB:
Activity Spreadsheet -- Enzyme Inhibition Constant Data from BindingDB
Found 2 hits for monomerid = 21227
TargetAdenosine receptor A3(Homo sapiens (Human))
Universita Di Napoli
LigandPNGBDBM21227(2-mercaptopyrimidine analogue, 5f | N-[6-methoxy-2...)
Affinity DataKi:  276nM. Assay description: The membranes prepared from CHO cells transfected with human adenosine A3 receptors were used in binding assays. Nonspecific binding was determined i...
In DepthDetails ArticlePubMed
TargetAdenosine receptor A1(Homo sapiens (Human))
Universita Di Napoli
LigandPNGBDBM21227(2-mercaptopyrimidine analogue, 5f | N-[6-methoxy-2...)
Affinity DataKi:  486nM ΔG°:  -8.61kcal/molepH: 7.4 T: 2°C. Assay description: The membranes prepared from CHO cells transfected with human adenosine A1 receptors were used in binding assays. Nonspecific binding was determined i...
In DepthDetails ArticlePubMed