BDBM217350 US9303018, 23
SMILES CC(C)C(=O)N1CCN(Cc2cnc3cc(Oc4ccc(cn4)-c4ccn[nH]4)ccc3c2)CC1
InChI Key InChIKey=TYQFYVYCKZCRQG-UHFFFAOYSA-N
Data  1 IC50
  Tab Delimited (TSV)   2D SDfile   Computed 3D by Vconf -m prep SDfile
Find this compound or compounds like it in BindingDB:
Activity Spreadsheet -- Enzyme Inhibition Constant Data from BindingDB
Found 1 hit for monomerid = 217350
TargetLeukotriene A-4 hydrolase(Homo sapiens (Human))
Boehringer Ingelheim International
US Patent
LigandPNGBDBM217350(US9303018, 23)
Affinity DataIC50:  0.540nMpH: 7.5 T: 2°C. Assay description: The compounds of the invention are assessed for the ability to interact with human LTA4 hydrolase in an enzymatic assay that measures the ability of ...
Ligand InfoPC cidPC sid
In DepthDetails US Patent