BDBM221065 7-(4-((4-((E)-3-(3,4,5-Trimetoxyphenylacryloyl)phenylcarbamoyl)methyl) piperazin-1-yl)-1-cyclopropyl-6-fluoro-1,4-dihydro-4-oxoquinoline-3-carbohydrazide (5e)
SMILES COc1cc(\C=C\C(=O)c2ccc(NC(=O)CN3CCN(CC3)c3cc4n(cc(C(=O)NN)c(=O)c4cc3F)C3CC3)cc2)cc(OC)c1OC
InChI Key InChIKey=KOMIFYDHCIMPGO-NYYWCZLTSA-N
Data  1 IC50
  Tab Delimited (TSV)   2D SDfile   Computed 3D by Vconf -m prep SDfile
Find this compound or compounds like it in BindingDB:
Activity Spreadsheet -- Enzyme Inhibition Constant Data from BindingDB
Found 1 hit for monomerid = 221065
TargetUrease subunit alpha(Helicobacter pylori)
Minia University
LigandPNGBDBM221065(7-(4-((4-((E)-3-(3,4,5-Trimetoxyphenylacryloyl)phe...)
Affinity DataIC50:  9.12E+5nM. Assay description: The assay mixture, containing 50 μl (2 mg/ml) of enzyme and 100 μl of different concentration of the tested agents, was added to 850 μ...
Ligand InfoPC cidPC sid
In DepthDetails ArticlePubMed